{"text_format":"1","workbook":"xlsx","n_sheets":6,"sheets":["Assumptions","Backup Values","Easy Input","Cases (the input)","Detailed_Output","Projected Bed Occupancy(output)"],"not_rendered":{"charts":3,"images":0,"macros":1,"external_links":0,"defined_names":0,"comments":0,"pivot_tables":0},"unopened":[],"bounds":{"document_bytes":16777216,"sheet_cells":100000,"rows_first":2000,"rows_last":500,"rows_between":2000,"halvings":0,"cell_chars":16384,"cell_head_chars":4096},"cells_cut":0,"cells_raw":0,"read":"whole","date_system":"1900"}

{"sheet":"Assumptions","index":0,"n_rows":342,"n_cols":11,"rows_kept":342,"cut":false,"hidden":false,"merged":[[1,0,1,9],[2,7,2,8],[0,0,0,9],[4,14,4,17],[2,4,2,6],[2,0,3,0],[2,1,3,1],[2,2,3,2],[2,3,3,3],[2,9,3,9]]}
["Assumptions Spreadsheet"]
["Below are the various estimates used by Delphi's 'Cases2Beds' spreadsheet program to map any set of cases into projected bed occupancies.\nEach row contains estimates for a different \"Patient Type\" (defined by a set of demographic traits).\nFor each such Patient Type, we estimate:\n   1. Probability of hospitalization (Hospitlization Rate).\n   2. For a patient who was hospitalized, the probability distribution of the number of days from patient's first positive test to their admission.  This can be a negative number, if the patient was hospitalized before testing positive.  We restict the distribution to the range [10, +30].\n   3. For a patient who was hospitalized, the probability distribution of the length of hospitalization, restricted to the range of [0,40] days.\nPlease fill out the hospitalization rate and distribution parameters with your own values if available. If more information is available please add it. To reset the sheet, click the \"reset sheet\" button\nIf some values are unspecified, default values are used.  If a row has an error, please ensure your input values are correct.  Please ensure there are no repeated rows. \n If you have any concerns, please contact us at delphi+cases2beds@cmu.edu"]
["Age Group","Race/Ethnicity","Gender","Hospitalization Rate [DEFAULT]","Distribution Parameters for Pos Test to Hospitalization \n (-10 to +30 Days) [DEFAULT]",null,null,"Distribution Parameters for Days of Hospitalization  \n(0 to 40+ Days)  [DEFAULT]",null,"Sum Check"]
[null,null,null,null,"Fraction of COVID Admissions that tested positive on Admission Date (or one day before/after)","Fraction of COVID Admissions that tested positive more than one day AFTER being admitted","Mean number of days from testing date to admission date, among admissions that happened more than one day after testing","Mean Length of Stay ","Fraction of Hospitalizations that last 0 days [Optional]"]
["unspecified","unspecified","unspecified",{"$f":"IFERROR(INDEX('Backup Values'!D$3:D$153, MATCH(1, (Assumptions!$A5='Backup Values'!$A$3:$A$153)*(Assumptions!$B5='Backup Values'!$B$3:$B$153)*(Assumptions!$C5='Backup Values'!$C$3:$C$153), 0)), \"\")","v":0.06},{"$f":"IFERROR(INDEX('Backup Values'!E$3:E$153, MATCH(1, (Assumptions!$A5='Backup Values'!$A$3:$A$153)*(Assumptions!$B5='Backup Values'!$B$3:$B$153)*(Assumptions!$C5='Backup Values'!$C$3:$C$153), 0)), \"\")","v":0.14575904200000001},{"$f":"IFERROR(INDEX('Backup Values'!F$3:F$153, MATCH(1, (Assumptions!$A5='Backup Values'!$A$3:$A$153)*(Assumptions!$B5='Backup Values'!$B$3:$B$153)*(Assumptions!$C5='Backup Values'!$C$3:$C$153), 0)), \"\")","v":0},{"$f":"IFERROR(INDEX('Backup Values'!G$3:G$153, MATCH(1, (Assumptions!$A5='Backup Values'!$A$3:$A$153)*(Assumptions!$B5='Backup Values'!$B$3:$B$153)*(Assumptions!$C5='Backup Values'!$C$3:$C$153), 0)), \"\")","v":6.4901326089999998},{"$f":"IFERROR(INDEX('Backup Values'!H$3:H$153, MATCH(1, (Assumptions!$A5='Backup Values'!$A$3:$A$153)*(Assumptions!$B5='Backup Values'!$B$3:$B$153)*(Assumptions!$C5='Backup Values'!$C$3:$C$153), 0)), \"\")","v":4.6000000009999997},{"$f":"IFERROR(INDEX('Backup Values'!I$3:I$153, MATCH(1, (Assumptions!$A5='Backup Values'!$A$3:$A$153)*(Assumptions!$B5='Backup Values'!$B$3:$B$153)*(Assumptions!$C5='Backup Values'!$C$3:$C$153), 0)), \"\")","v":0.05},{"$f":"IFERROR(IF(E5+F5 <1, \"\", ERROR), \"\")","v":""}]
["0-9","unspecified","unspecified",{"$f":"IFERROR(INDEX('Backup Values'!D$3:D$153, MATCH(1, (Assumptions!$A6='Backup Values'!$A$3:$A$153)*(Assumptions!$B6='Backup Values'!$B$3:$B$153)*(Assumptions!$C6='Backup Values'!$C$3:$C$153), 0)), \"\")","v":0.01},{"$f":"IFERROR(INDEX('Backup Values'!E$3:E$153, MATCH(1, (Assumptions!$A6='Backup Values'!$A$3:$A$153)*(Assumptions!$B6='Backup Values'!$B$3:$B$153)*(Assumptions!$C6='Backup Values'!$C$3:$C$153), 0)), \"\")","v":0.15882352899999999},{"$f":"IFERROR(INDEX('Backup Values'!F$3:F$153, MATCH(1, (Assumptions!$A6='Backup Values'!$A$3:$A$153)*(Assumptions!$B6='Backup Values'!$B$3:$B$153)*(Assumptions!$C6='Backup Values'!$C$3:$C$153), 0)), \"\")","v":0},{"$f":"IFERROR(INDEX('Backup Values'!G$3:G$153, MATCH(1, (Assumptions!$A6='Backup Values'!$A$3:$A$153)*(Assumptions!$B6='Backup Values'!$B$3:$B$153)*(Assumptions!$C6='Backup Values'!$C$3:$C$153), 0)), \"\")","v":5.5978260869999996},{"$f":"IFERROR(INDEX('Backup Values'!H$3:H$153, MATCH(1, (Assumptions!$A6='Backup Values'!$A$3:$A$153)*(Assumptions!$B6='Backup Values'!$B$3:$B$153)*(Assumptions!$C6='Backup Values'!$C$3:$C$153), 0)), \"\")","v":4.2679999999999998},{"$f":"IFERROR(INDEX('Backup Values'!I$3:I$153, MATCH(1, (Assumptions!$A6='Backup Values'!$A$3:$A$153)*(Assumptions!$B6='Backup Values'!$B$3:$B$153)*(Assumptions!$C6='Backup Values'!$C$3:$C$153), 0)), \"\")","v":0.05},{"$f":"IFERROR(IF(E6+F6 <1, \"\", ERROR), \"\")","v":""}]
["10-19","unspecified","unspecified",{"$f":"IFERROR(INDEX('Backup Values'!D$3:D$153, MATCH(1, (Assumptions!$A7='Backup Values'!$A$3:$A$153)*(Assumptions!$B7='Backup Values'!$B$3:$B$153)*(Assumptions!$C7='Backup Values'!$C$3:$C$153), 0)), \"\")","v":4.0000000000000001E-3},{"$f":"IFERROR(INDEX('Backup Values'!E$3:E$153, MATCH(1, (Assumptions!$A7='Backup Values'!$A$3:$A$153)*(Assumptions!$B7='Backup Values'!$B$3:$B$153)*(Assumptions!$C7='Backup Values'!$C$3:$C$153), 0)), \"\")","v":0.15384615400000001},{"$f":"IFERROR(INDEX('Backup Values'!F$3:F$153, MATCH(1, (Assumptions!$A7='Backup Values'!$A$3:$A$153)*(Assumptions!$B7='Backup Values'!$B$3:$B$153)*(Assumptions!$C7='Backup Values'!$C$3:$C$153), 0)), \"\")","v":0},{"$f":"IFERROR(INDEX('Backup Values'!G$3:G$153, MATCH(1, (Assumptions!$A7='Backup Values'!$A$3:$A$153)*(Assumptions!$B7='Backup Values'!$B$3:$B$153)*(Assumptions!$C7='Backup Values'!$C$3:$C$153), 0)), \"\")","v":5},{"$f":"IFERROR(INDEX('Backup Values'!H$3:H$153, MATCH(1, (Assumptions!$A7='Backup Values'!$A$3:$A$153)*(Assumptions!$B7='Backup Values'!$B$3:$B$153)*(Assumptions!$C7='Backup Values'!$C$3:$C$153), 0)), \"\")","v":4.2679999999999998},{"$f":"IFERROR(INDEX('Backup Values'!I$3:I$153, MATCH(1, (Assumptions!$A7='Backup Values'!$A$3:$A$153)*(Assumptions!$B7='Backup Values'!$B$3:$B$153)*(Assumptions!$C7='Backup Values'!$C$3:$C$153), 0)), \"\")","v":0.05},{"$f":"IFERROR(IF(E7+F7 <1, \"\", ERROR), \"\")","v":""}]
["20-29","unspecified","unspecified",{"$f":"IFERROR(INDEX('Backup Values'!D$3:D$153, MATCH(1, (Assumptions!$A8='Backup Values'!$A$3:$A$153)*(Assumptions!$B8='Backup Values'!$B$3:$B$153)*(Assumptions!$C8='Backup Values'!$C$3:$C$153), 0)), \"\")","v":0.01},{"$f":"IFERROR(INDEX('Backup Values'!E$3:E$153, MATCH(1, (Assumptions!$A8='Backup Values'!$A$3:$A$153)*(Assumptions!$B8='Backup Values'!$B$3:$B$153)*(Assumptions!$C8='Backup Values'!$C$3:$C$153), 0)), \"\")","v":0.185185185},{"$f":"IFERROR(INDEX('Backup Values'!F$3:F$153, MATCH(1, (Assumptions!$A8='Backup Values'!$A$3:$A$153)*(Assumptions!$B8='Backup Values'!$B$3:$B$153)*(Assumptions!$C8='Backup Values'!$C$3:$C$153), 0)), \"\")","v":0},{"$f":"IFERROR(INDEX('Backup Values'!G$3:G$153, MATCH(1, (Assumptions!$A8='Backup Values'!$A$3:$A$153)*(Assumptions!$B8='Backup Values'!$B$3:$B$153)*(Assumptions!$C8='Backup Values'!$C$3:$C$153), 0)), \"\")","v":5},{"$f":"IFERROR(INDEX('Backup Values'!H$3:H$153, MATCH(1, (Assumptions!$A8='Backup Values'!$A$3:$A$153)*(Assumptions!$B8='Backup Values'!$B$3:$B$153)*(Assumptions!$C8='Backup Values'!$C$3:$C$153), 0)), \"\")","v":5.7399999990000001},{"$f":"IFERROR(INDEX('Backup Values'!I$3:I$153, MATCH(1, (Assumptions!$A8='Backup Values'!$A$3:$A$153)*(Assumptions!$B8='Backup Values'!$B$3:$B$153)*(Assumptions!$C8='Backup Values'!$C$3:$C$153), 0)), \"\")","v":0.05},{"$f":"IFERROR(IF(E8+F8 <1, \"\", ERROR), \"\")","v":""}]
["30-39","unspecified","unspecified",{"$f":"IFERROR(INDEX('Backup Values'!D$3:D$153, MATCH(1, (Assumptions!$A9='Backup Values'!$A$3:$A$153)*(Assumptions!$B9='Backup Values'!$B$3:$B$153)*(Assumptions!$C9='Backup Values'!$C$3:$C$153), 0)), \"\")","v":0.02},{"$f":"IFERROR(INDEX('Backup Values'!E$3:E$153, MATCH(1, (Assumptions!$A9='Backup Values'!$A$3:$A$153)*(Assumptions!$B9='Backup Values'!$B$3:$B$153)*(Assumptions!$C9='Backup Values'!$C$3:$C$153), 0)), \"\")","v":0.140217391},{"$f":"IFERROR(INDEX('Backup Values'!F$3:F$153, MATCH(1, (Assumptions!$A9='Backup Values'!$A$3:$A$153)*(Assumptions!$B9='Backup Values'!$B$3:$B$153)*(Assumptions!$C9='Backup Values'!$C$3:$C$153), 0)), \"\")","v":0},{"$f":"IFERROR(INDEX('Backup Values'!G$3:G$153, MATCH(1, (Assumptions!$A9='Backup Values'!$A$3:$A$153)*(Assumptions!$B9='Backup Values'!$B$3:$B$153)*(Assumptions!$C9='Backup Values'!$C$3:$C$153), 0)), \"\")","v":5.853432282},{"$f":"IFERROR(INDEX('Backup Values'!H$3:H$153, MATCH(1, (Assumptions!$A9='Backup Values'!$A$3:$A$153)*(Assumptions!$B9='Backup Values'!$B$3:$B$153)*(Assumptions!$C9='Backup Values'!$C$3:$C$153), 0)), \"\")","v":5.7399999990000001},{"$f":"IFERROR(INDEX('Backup Values'!I$3:I$153, MATCH(1, (Assumptions!$A9='Backup Values'!$A$3:$A$153)*(Assumptions!$B9='Backup Values'!$B$3:$B$153)*(Assumptions!$C9='Backup Values'!$C$3:$C$153), 0)), \"\")","v":0.05},{"$f":"IFERROR(IF(E9+F9 <1, \"\", ERROR), \"\")","v":""}]
["40-49","unspecified","unspecified",{"$f":"IFERROR(INDEX('Backup Values'!D$3:D$153, MATCH(1, (Assumptions!$A10='Backup Values'!$A$3:$A$153)*(Assumptions!$B10='Backup Values'!$B$3:$B$153)*(Assumptions!$C10='Backup Values'!$C$3:$C$153), 0)), \"\")","v":0.03},{"$f":"IFERROR(INDEX('Backup Values'!E$3:E$153, MATCH(1, (Assumptions!$A10='Backup Values'!$A$3:$A$153)*(Assumptions!$B10='Backup Values'!$B$3:$B$153)*(Assumptions!$C10='Backup Values'!$C$3:$C$153), 0)), \"\")","v":0.131884058},{"$f":"IFERROR(INDEX('Backup Values'!F$3:F$153, MATCH(1, (Assumptions!$A10='Backup Values'!$A$3:$A$153)*(Assumptions!$B10='Backup Values'!$B$3:$B$153)*(Assumptions!$C10='Backup Values'!$C$3:$C$153), 0)), \"\")","v":0},{"$f":"IFERROR(INDEX('Backup Values'!G$3:G$153, MATCH(1, (Assumptions!$A10='Backup Values'!$A$3:$A$153)*(Assumptions!$B10='Backup Values'!$B$3:$B$153)*(Assumptions!$C10='Backup Values'!$C$3:$C$153), 0)), \"\")","v":6.5225733630000002},{"$f":"IFERROR(INDEX('Backup Values'!H$3:H$153, MATCH(1, (Assumptions!$A10='Backup Values'!$A$3:$A$153)*(Assumptions!$B10='Backup Values'!$B$3:$B$153)*(Assumptions!$C10='Backup Values'!$C$3:$C$153), 0)), \"\")","v":7.1749999999999998},{"$f":"IFERROR(INDEX('Backup Values'!I$3:I$153, MATCH(1, (Assumptions!$A10='Backup Values'!$A$3:$A$153)*(Assumptions!$B10='Backup Values'!$B$3:$B$153)*(Assumptions!$C10='Backup Values'!$C$3:$C$153), 0)), \"\")","v":0.05},{"$f":"IFERROR(IF(E10+F10 <1, \"\", ERROR), \"\")","v":""}]
{"$rows_left_out":333}
{"sheet":"Backup Values","index":1,"n_rows":18,"n_cols":9,"rows_kept":18,"cut":false,"hidden":true,"merged":[[0,0,0,8],[1,4,1,6],[1,7,1,8]]}
["Standard Parameter values "]
["Age Group ","Race/Ethnicity","Gender","Hospitalization Rates","Offset Params [0, f1, m2]",null,null,"Duration Params [0, m]"]
["unspecified","unspecified","unspecified",0.06,0.14575904200000001,0,6.4901326089999998,4.6000000009999997,0.05]
["unspecified","unspecified","M",7.0000000000000007E-2,0.14573089,0,6.4899476439999999,4.6000000009999997,0.05]
["unspecified","unspecified","F",0.06,0.143147621,0,6.5394154120000003,4.6000000009999997,0.05]
["unspecified","Black","unspecified",0.1,0.14575904200000001,0,6.4901326089999998,4.6000000009999997,0.05]
["unspecified","White","unspecified",7.0000000000000007E-2,0.14575904200000001,0,6.4901326089999998,4.6000000009999997,0.05]
["unspecified","Asian","unspecified",0.05,0.14575904200000001,0,6.4901326089999998,4.6000000009999997,0.05]
["unspecified","Hispanic","unspecified",0.04,0.14575904200000001,0,6.4901326089999998,4.6000000009999997,0.05]
["0-9","unspecified","unspecified",0.01,0.15882352899999999,0,5.5978260869999996,4.2679999999999998,0.05]
{"$rows_left_out":9}
{"sheet":"Easy Input","index":2,"n_rows":39,"n_cols":8,"rows_kept":39,"cut":false,"hidden":false,"merged":[[0,0,2,7]]}
["Use this sheet to populate the next tab: \"Cases (the input)\"\nEnsure all distributions sum to 1."]
[]
[]
["Age Group","%of such Cases ","Gender\n(F, M, or unspecified)","%of such Cases ","Race/Ethnicity (Black, White, Asian, Hispanic, or unspecified)","%of such Cases ","Dates (Mandatory)","Cases (default 1)"]
["0-9",0.2,"F",0.50660729675380634,"Black",1.8241884515943694E-2,"2021-11-12",100]
["10-19",0.1,"M",0.4916690606147659,"White",0.16819879345015801,"2021-11-13",100]
["20-29",0.1,"unspecified",1.72364263142776E-3,"Asian",9.9683998850904912E-2,"2021-11-14",100]
["30-39",0.1,"SUM TO 1? ",{"$f":"IF(SUM(D5:D7) -1 =0, \"YES\", \"ERROR\")","v":"YES"},"Hispanic",0.39859235851766733,"2021-11-15",100]
["40-49",0.1,null,null,"unspecified",0.31528296466532613,"2021-11-16",100]
["50-59",0.1,null,null,"SUM TO 1? ",{"$f":"IF(SUM(F5:F9) -1 =0, \"YES\", \"ERROR\")","v":"YES"},"2021-11-17",100]
{"$rows_left_out":30}
{"sheet":"Cases (the input)","index":3,"n_rows":324,"n_cols":7,"rows_kept":324,"cut":false,"hidden":false,"merged":[[1,0,1,6],[0,0,0,6]]}
["Input Cases:"]
["Below, please enter the cases you would like to see mapped into projected hospital bed occupancies (date is the specimen testing date).\n  * You can enter actual reported cases from your database, and/or hypothesized cases if you want to ask \"what if\" questions.\n  * For each such case, you may enter the value of the traits you know (age group, gender, etc.), and leave any other traits blank (or enter them as \"Unspecified').\n  * The more traits you know about a case, the more accurately we can estimate their expected impact on bed occupancy. \n  * Multiple cases which share the same testing date and the exact same trait values can be specified on a single row, using the \"Number of Cases\" (column B).\nWhen done, go to the next tab (Projected Bed Occupancies) to calculate and see the output. Please do not leave any blank lines.\nNote: when entering Age Group, please use one of  '0-9, '10-19, '20-29, ....  '60-69, '70-79, '80+, and include the leading apostrophe, to prevent the entry from being interpreted as a date."]
["Specimen Testing Date (mandatory)","Number of such Cases (optional, defaults to 1)","Age Group\n(optional but highly desirable)","Race/Ethnicity (Black, White, Asian, Hispanic, or unspecified)\n","Gender\n(F, M, or unspecified)","Already Hospitalized?\n(optional, to be discussed)","Comments (optional, will be ignored)"]
["2020-10-03",1,"10-19","White","F",null,"This is an example row.  Ignore it - it will not be used."]
["2020-11-12",0,"0-9","unspecified","unspecified"]
["2020-11-12",0,"10-19","unspecified","unspecified"]
["2020-11-12",1,"20-29","unspecified","unspecified"]
["2020-11-12",2,"30-39","unspecified","unspecified"]
["2020-11-12",5,"40-49","unspecified","unspecified"]
["2020-11-12",5,"50-59","unspecified","unspecified"]
{"$rows_left_out":315}
{"sheet":"Detailed_Output","index":4,"n_rows":543,"n_cols":15,"rows_kept":543,"cut":false,"hidden":true,"merged":[[0,0,0,5],[1,0,1,9]]}
["Projected Bed Occupancy (output of the program)"]
["To see the bed occupancy projected by the program based on the cases you entered in the previous tab, please click the \"Generate New Graph\" button to the right."]
["Dates","Mean ","Variance","StDev",null,"Q_50","Q_95","Q_5","Q_75","Q-25",null,"Projected peak bed occupancy for this set of cases:"]
["2020-10-22",0,0,{"$f":"SQRT(C4)","v":0},null,{"$f":"B4","v":0},{"$f":"1.645*D4+B4","v":0},{"$f":"MAX(-1.645*D4+B4,0 )","v":0},{"$f":"0.675*D4+B4","v":0},{"$f":"MAX(-0.675*D4+B4,0)","v":0},null,"Date:","expected bed occupancy:","95% confidence limit:","Time "]
["2020-10-23",0,0,{"$f":"SQRT(C5)","v":0},null,0,0,{"$f":"MAX(-1.645*D5+B5,0 )","v":0},{"$f":"0.675*D5+B5","v":0},{"$f":"MAX(-0.675*D5+B5,0)","v":0},null,{"$f":"INDEX(A:A,MATCH(MAX(F:F),F:F,0))","v":"2020-11-09"},{"$f":"MAX(F:F)","v":5.2659579027757548},{"$f":"INDEX(G:G,MATCH(MAX(F:F),F:F,0))","v":8.8786563882063927},6.6953125]
["2020-10-24",0,0,0,null,0,0,0,0,0]
["2020-10-25",0,0,0,null,0,0,0,0,0]
["2020-10-26",0,0,0,null,0,0,0,0,0]
["2020-10-27",0,0,0,null,0,0,0,0,0]
["2020-10-28",0,0,0,null,0,0,0,0,0]
{"$rows_left_out":534}
{"sheet":"Projected Bed Occupancy(output)","index":5,"n_rows":9,"n_cols":4,"rows_kept":9,"cut":false,"hidden":false,"merged":[[1,0,1,9],[6,0,6,3],[0,0,0,9]]}
["Projected Bed Occupancy (output of the program)"]
["To see the bed occupancy projected by the program based on the cases you entered in the previous tab, please click the \"Generate New Graph\" button below."]
[]
[]
[]
[]
[{"$f":"Detailed_Output!L3","v":"Projected peak bed occupancy for this set of cases:"}]
[{"$f":"Detailed_Output!L4","v":"Date:"},{"$f":"Detailed_Output!M4","v":"expected bed occupancy:"},{"$f":"Detailed_Output!N4","v":"95% confidence limit:"},{"$f":"Detailed_Output!O4","v":"Time "}]
[{"$f":"Detailed_Output!L5","v":"2020-11-09"},{"$f":"Detailed_Output!M5","v":5.2659579027757548},{"$f":"Detailed_Output!N5","v":8.8786563882063927},{"$f":"Detailed_Output!O5","v":6.6953125}]